Skip to content

fix: write openocd debug output to a file #90

fix: write openocd debug output to a file

fix: write openocd debug output to a file #90

Triggered via pull request July 21, 2025 10:48
@sigmaaasigmaaa
synchronize #1274
IEP-1536
Status Success
Total duration 55s
Artifacts 1

docs_build.yml

on: pull_request
Build Espressif-IDE Docs
51s
Build Espressif-IDE Docs
Fit to window
Zoom out
Zoom in

Annotations

3 errors
com.espressif.idf.ui.test.executable.cases.project.IDFProjectLspCdtFunctionalityTest ► test_HoverInformationAppears: tests/com.espressif.idf.ui.test/target/surefire-reports/TEST-com.espressif.idf.ui.test.executable.cases.project.IDFProjectLspCdtFunctionalityTest.xml#L0
Failed test found in: tests/com.espressif.idf.ui.test/target/surefire-reports/TEST-com.espressif.idf.ui.test.executable.cases.project.IDFProjectLspCdtFunctionalityTest.xml Error: org.eclipse.swtbot.swt.finder.exceptions.WidgetNotFoundException: Could not find widget matching: (of type 'Browser')
com.espressif.idf.ui.test.executable.cases.project.NewEspressifIDFProjectSDKconfigTest ► givenNewProjectIsCreatedWhenSDKconfigFileOpenedEditedSavedThenBuiltReopenedAndChecked: tests/com.espressif.idf.ui.test/target/surefire-reports/TEST-com.espressif.idf.ui.test.executable.cases.project.NewEspressifIDFProjectSDKconfigTest.xml#L0
Failed test found in: tests/com.espressif.idf.ui.test/target/surefire-reports/TEST-com.espressif.idf.ui.test.executable.cases.project.NewEspressifIDFProjectSDKconfigTest.xml Error: java.lang.AssertionError
com.espressif.idf.ui.test.executable.cases.project.NewEspressifIDFProjectTest ► givenMainCFileOpenedThenNoErrorsShouldBeInErrorLog: tests/com.espressif.idf.ui.test/target/surefire-reports/TEST-com.espressif.idf.ui.test.executable.cases.project.NewEspressifIDFProjectTest.xml#L0
Failed test found in: tests/com.espressif.idf.ui.test/target/surefire-reports/TEST-com.espressif.idf.ui.test.executable.cases.project.NewEspressifIDFProjectTest.xml Error: org.eclipse.swtbot.swt.finder.exceptions.WidgetNotFoundException: Could not find node with text: Error Log

Artifacts

Produced during runtime
Name Size Digest
docs Expired
34.9 MB
sha256:e439935a0c5f75fe8cce7c77d381738698d41922542344225293c5dc6b824173