Skip to content

Eim action test

Eim action test #2004

Triggered via pull request September 17, 2025 13:28
Status Failure
Total duration 3h 18m 4s
Artifacts

ci_windows.yml

on: pull_request
Fit to window
Zoom out
Zoom in

Annotations

12 errors and 1 warning
com.espressif.idf.ui.test.EspressifMenuTest ► testProductInformation: tests/com.espressif.idf.ui.test/target/surefire-reports/TEST-com.espressif.idf.ui.test.EspressifMenuTest.xml#L0
Failed test found in: tests/com.espressif.idf.ui.test/target/surefire-reports/TEST-com.espressif.idf.ui.test.EspressifMenuTest.xml Error: org.eclipse.swtbot.swt.finder.widgets.TimeoutException: Timeout after: 5000 ms.: Timed out waiting for Shell {workspace} to get activated
com.espressif.idf.ui.test.executable.cases.launchconfiguration.LaunchBarCDTConfigurationsTest ► : tests/com.espressif.idf.ui.test/target/surefire-reports/TEST-com.espressif.idf.ui.test.executable.cases.launchconfiguration.LaunchBarCDTConfigurationsTest.xml#L0
Failed test found in: tests/com.espressif.idf.ui.test/target/surefire-reports/TEST-com.espressif.idf.ui.test.executable.cases.launchconfiguration.LaunchBarCDTConfigurationsTest.xml Error: org.opentest4j.MultipleFailuresError:
com.espressif.idf.ui.test.executable.cases.project.IDFProjectJTAGFlashTest ► : tests/com.espressif.idf.ui.test/target/surefire-reports/TEST-com.espressif.idf.ui.test.executable.cases.project.IDFProjectJTAGFlashTest.xml#L0
Failed test found in: tests/com.espressif.idf.ui.test/target/surefire-reports/TEST-com.espressif.idf.ui.test.executable.cases.project.IDFProjectJTAGFlashTest.xml Error: org.eclipse.swtbot.swt.finder.exceptions.WidgetNotFoundException: Could not find editor matching: with name '"ESP-IDF Manager"'
com.espressif.idf.ui.test.executable.cases.project.IDFProjectLspCdtFunctionalityTest ► : tests/com.espressif.idf.ui.test/target/surefire-reports/TEST-com.espressif.idf.ui.test.executable.cases.project.IDFProjectLspCdtFunctionalityTest.xml#L0
Failed test found in: tests/com.espressif.idf.ui.test/target/surefire-reports/TEST-com.espressif.idf.ui.test.executable.cases.project.IDFProjectLspCdtFunctionalityTest.xml Error: org.opentest4j.MultipleFailuresError:
com.espressif.idf.ui.test.executable.cases.project.NewEspressifIDFProjectClangFilesTest ► : tests/com.espressif.idf.ui.test/target/surefire-reports/TEST-com.espressif.idf.ui.test.executable.cases.project.NewEspressifIDFProjectClangFilesTest.xml#L0
Failed test found in: tests/com.espressif.idf.ui.test/target/surefire-reports/TEST-com.espressif.idf.ui.test.executable.cases.project.NewEspressifIDFProjectClangFilesTest.xml Error: org.eclipse.swtbot.swt.finder.exceptions.WidgetNotFoundException: Could not find editor matching: with name '"ESP-IDF Manager"'
com.espressif.idf.ui.test.executable.cases.project.NewEspressifIDFProjectFlashProcessTest ► : tests/com.espressif.idf.ui.test/target/surefire-reports/TEST-com.espressif.idf.ui.test.executable.cases.project.NewEspressifIDFProjectFlashProcessTest.xml#L0
Failed test found in: tests/com.espressif.idf.ui.test/target/surefire-reports/TEST-com.espressif.idf.ui.test.executable.cases.project.NewEspressifIDFProjectFlashProcessTest.xml Error: org.eclipse.swtbot.swt.finder.exceptions.WidgetNotFoundException: Could not find editor matching: with name '"ESP-IDF Manager"'
com.espressif.idf.ui.test.executable.cases.project.NewEspressifIDFProjectPartitionTableEditorTest ► : tests/com.espressif.idf.ui.test/target/surefire-reports/TEST-com.espressif.idf.ui.test.executable.cases.project.NewEspressifIDFProjectPartitionTableEditorTest.xml#L0
Failed test found in: tests/com.espressif.idf.ui.test/target/surefire-reports/TEST-com.espressif.idf.ui.test.executable.cases.project.NewEspressifIDFProjectPartitionTableEditorTest.xml Error: org.eclipse.swtbot.swt.finder.exceptions.WidgetNotFoundException: Could not find editor matching: with name '"ESP-IDF Manager"'
com.espressif.idf.ui.test.executable.cases.project.NewEspressifIDFProjectSBOMTest ► : tests/com.espressif.idf.ui.test/target/surefire-reports/TEST-com.espressif.idf.ui.test.executable.cases.project.NewEspressifIDFProjectSBOMTest.xml#L0
Failed test found in: tests/com.espressif.idf.ui.test/target/surefire-reports/TEST-com.espressif.idf.ui.test.executable.cases.project.NewEspressifIDFProjectSBOMTest.xml Error: org.eclipse.swtbot.swt.finder.exceptions.WidgetNotFoundException: Could not find editor matching: with name '"ESP-IDF Manager"'
com.espressif.idf.ui.test.executable.cases.project.NewEspressifIDFProjectSDKconfigTest ► : tests/com.espressif.idf.ui.test/target/surefire-reports/TEST-com.espressif.idf.ui.test.executable.cases.project.NewEspressifIDFProjectSDKconfigTest.xml#L0
Failed test found in: tests/com.espressif.idf.ui.test/target/surefire-reports/TEST-com.espressif.idf.ui.test.executable.cases.project.NewEspressifIDFProjectSDKconfigTest.xml Error: org.eclipse.swtbot.swt.finder.exceptions.WidgetNotFoundException: Could not find editor matching: with name '"ESP-IDF Manager"'
com.espressif.idf.ui.test.executable.cases.project.NewEspressifIDFProjectTest ► : tests/com.espressif.idf.ui.test/target/surefire-reports/TEST-com.espressif.idf.ui.test.executable.cases.project.NewEspressifIDFProjectTest.xml#L0
Failed test found in: tests/com.espressif.idf.ui.test/target/surefire-reports/TEST-com.espressif.idf.ui.test.executable.cases.project.NewEspressifIDFProjectTest.xml Error: org.eclipse.swtbot.swt.finder.exceptions.WidgetNotFoundException: Could not find editor matching: with name '"ESP-IDF Manager"'
build_windows
Failed tests were found and 'fail-on-error' option is set to true
build_windows
Process completed with exit code 1.
build_windows
Unable to clean or reset the repository. The repository will be recreated instead.