Skip to content

Dynamic ESP-IDF Target Discovery and Support Preview Targets #1180

Dynamic ESP-IDF Target Discovery and Support Preview Targets

Dynamic ESP-IDF Target Discovery and Support Preview Targets #1180

Triggered via pull request September 29, 2025 08:15
Status Success
Total duration 20s
Artifacts

pre-commit.yml

on: pull_request
precommit
17s
precommit
Fit to window
Zoom out
Zoom in

Annotations

3 errors
com.espressif.idf.ui.test.executable.cases.project.IDFProjectJTAGFlashTest ► givenNewProjectCreatedWhenSelectJTAGflashWhenBuiltThenCheckFlashedSuccessfully: tests/com.espressif.idf.ui.test/target/surefire-reports/TEST-com.espressif.idf.ui.test.executable.cases.project.IDFProjectJTAGFlashTest.xml#L0
Failed test found in: tests/com.espressif.idf.ui.test/target/surefire-reports/TEST-com.espressif.idf.ui.test.executable.cases.project.IDFProjectJTAGFlashTest.xml Error: java.lang.RuntimeException: Item `ESP32-ETHERNET-KIT [usb://1-10]' not found in combo box.
com.espressif.idf.ui.test.executable.cases.project.NewEspressifIDFProjectClangFilesTest ► givenNewProjectIsCreatedWhenBuiltThenClangdDriversUpdateOnTargetWhenChangeTargetAndBuiltThenClangdDriversUpdateOnTargetChange: tests/com.espressif.idf.ui.test/target/surefire-reports/TEST-com.espressif.idf.ui.test.executable.cases.project.NewEspressifIDFProjectClangFilesTest.xml#L0
Failed test found in: tests/com.espressif.idf.ui.test/target/surefire-reports/TEST-com.espressif.idf.ui.test.executable.cases.project.NewEspressifIDFProjectClangFilesTest.xml Error: org.eclipse.swtbot.swt.finder.exceptions.WidgetNotFoundException: Could not find widget matching: with text 'esp32s2'
com.espressif.idf.ui.test.executable.cases.project.NewEspressifIDFProjectFlashProcessTest ► givenNewProjectCreatedBuiltWhenSelectSerialPortWhenFlashThenCheckFlashedSuccessfully: tests/com.espressif.idf.ui.test/target/surefire-reports/TEST-com.espressif.idf.ui.test.executable.cases.project.NewEspressifIDFProjectFlashProcessTest.xml#L0
Failed test found in: tests/com.espressif.idf.ui.test/target/surefire-reports/TEST-com.espressif.idf.ui.test.executable.cases.project.NewEspressifIDFProjectFlashProcessTest.xml Error: org.eclipse.swtbot.swt.finder.widgets.TimeoutException: Timeout after: 120000 ms.: Text not found!