Skip to content

feat: add kconfig editor support #1266

feat: add kconfig editor support

feat: add kconfig editor support #1266

Triggered via pull request November 19, 2025 06:00
Status Success
Total duration 23s
Artifacts

pre-commit.yml

on: pull_request
precommit
20s
precommit
Fit to window
Zoom out
Zoom in

Annotations

4 errors
com.espressif.idf.ui.test.executable.cases.project.IDFProjectJTAGFlashTest ► givenNewProjectCreatedWhenSelectJTAGflashWhenBuiltThenCheckFlashedSuccessfully: tests/com.espressif.idf.ui.test/target/surefire-reports/TEST-com.espressif.idf.ui.test.executable.cases.project.IDFProjectJTAGFlashTest.xml#L0
Failed test found in: tests/com.espressif.idf.ui.test/target/surefire-reports/TEST-com.espressif.idf.ui.test.executable.cases.project.IDFProjectJTAGFlashTest.xml Error: java.lang.RuntimeException: Item `ESP32-ETHERNET-KIT [usb://1-10]' not found in combo box.
com.espressif.idf.ui.test.executable.cases.project.NewEspressifIDFProjectFlashProcessTest ► givenNewProjectCreatedBuiltWhenSelectSerialPortWhenFlashThenCheckFlashedSuccessfully: tests/com.espressif.idf.ui.test/target/surefire-reports/TEST-com.espressif.idf.ui.test.executable.cases.project.NewEspressifIDFProjectFlashProcessTest.xml#L0
Failed test found in: tests/com.espressif.idf.ui.test/target/surefire-reports/TEST-com.espressif.idf.ui.test.executable.cases.project.NewEspressifIDFProjectFlashProcessTest.xml Error: java.lang.RuntimeException: Item `/dev/ttyUSB1 Dual RS232-HS' not found in combo box.
com.espressif.idf.ui.test.executable.cases.project.IDFProjectJTAGFlashTest ► givenNewProjectCreatedWhenSelectJTAGflashWhenBuiltThenCheckFlashedSuccessfully: tests/com.espressif.idf.ui.test/target/surefire-reports/TEST-com.espressif.idf.ui.test.executable.cases.project.IDFProjectJTAGFlashTest.xml#L0
Failed test found in: tests/com.espressif.idf.ui.test/target/surefire-reports/TEST-com.espressif.idf.ui.test.executable.cases.project.IDFProjectJTAGFlashTest.xml Error: java.lang.RuntimeException: Item `ESP32-ETHERNET-KIT [usb://1-10]' not found in combo box.
com.espressif.idf.ui.test.executable.cases.project.NewEspressifIDFProjectFlashProcessTest ► givenNewProjectCreatedBuiltWhenSelectSerialPortWhenFlashThenCheckFlashedSuccessfully: tests/com.espressif.idf.ui.test/target/surefire-reports/TEST-com.espressif.idf.ui.test.executable.cases.project.NewEspressifIDFProjectFlashProcessTest.xml#L0
Failed test found in: tests/com.espressif.idf.ui.test/target/surefire-reports/TEST-com.espressif.idf.ui.test.executable.cases.project.NewEspressifIDFProjectFlashProcessTest.xml Error: java.lang.RuntimeException: Item `/dev/ttyUSB1 Dual RS232-HS' not found in combo box.