Skip to content

Feat/add codespell checks for local development and CI/CD #149

Feat/add codespell checks for local development and CI/CD

Feat/add codespell checks for local development and CI/CD #149

Triggered via pull request November 19, 2025 06:18
Status Success
Total duration 1m 11s
Artifacts 1

docs_build.yml

on: pull_request
Build Espressif-IDE Docs
1m 7s
Build Espressif-IDE Docs
Fit to window
Zoom out
Zoom in

Annotations

3 errors
com.espressif.idf.ui.test.executable.cases.project.IDFProjectJTAGFlashTest ► givenNewProjectCreatedWhenSelectJTAGflashWhenBuiltThenCheckFlashedSuccessfully: tests/com.espressif.idf.ui.test/target/surefire-reports/TEST-com.espressif.idf.ui.test.executable.cases.project.IDFProjectJTAGFlashTest.xml#L0
Failed test found in: tests/com.espressif.idf.ui.test/target/surefire-reports/TEST-com.espressif.idf.ui.test.executable.cases.project.IDFProjectJTAGFlashTest.xml Error: java.lang.RuntimeException: Item `ESP32-ETHERNET-KIT [usb://1-10]' not found in combo box.
com.espressif.idf.ui.test.executable.cases.project.NewEspressifIDFProjectClangFilesTest ► givenNewProjectsAreCreatedAndBuiltWhenPreferencesOpenedThenClangdArgumentMatchesExpected: tests/com.espressif.idf.ui.test/target/surefire-reports/TEST-com.espressif.idf.ui.test.executable.cases.project.NewEspressifIDFProjectClangFilesTest.xml#L0
Failed test found in: tests/com.espressif.idf.ui.test/target/surefire-reports/TEST-com.espressif.idf.ui.test.executable.cases.project.NewEspressifIDFProjectClangFilesTest.xml Error: java.lang.AssertionError
com.espressif.idf.ui.test.executable.cases.project.NewEspressifIDFProjectFlashProcessTest ► givenNewProjectCreatedBuiltWhenSelectSerialPortWhenFlashThenCheckFlashedSuccessfully: tests/com.espressif.idf.ui.test/target/surefire-reports/TEST-com.espressif.idf.ui.test.executable.cases.project.NewEspressifIDFProjectFlashProcessTest.xml#L0
Failed test found in: tests/com.espressif.idf.ui.test/target/surefire-reports/TEST-com.espressif.idf.ui.test.executable.cases.project.NewEspressifIDFProjectFlashProcessTest.xml Error: java.lang.RuntimeException: Item `/dev/ttyUSB1 Dual RS232-HS' not found in combo box.

Artifacts

Produced during runtime
Name Size Digest
docs
36.8 MB
sha256:957764ad96169d060a8ed79167e266985e8d6e93e2bb8a0dea7dc884b4805230