WIP: SWTBot test case: Environment Variables verification #3784
ci.yml
on: pull_request
build_linux
14m 12s
build_macos
8m 34s
Annotations
13 errors
|
com.espressif.idf.ui.test.executable.cases.launchconfiguration.LaunchBarCDTConfigurationsTest ► :
tests/com.espressif.idf.ui.test/target/surefire-reports/TEST-com.espressif.idf.ui.test.executable.cases.launchconfiguration.LaunchBarCDTConfigurationsTest.xml#L0
Failed test found in:
tests/com.espressif.idf.ui.test/target/surefire-reports/TEST-com.espressif.idf.ui.test.executable.cases.launchconfiguration.LaunchBarCDTConfigurationsTest.xml
Error:
org.opentest4j.MultipleFailuresError:
|
|
com.espressif.idf.ui.test.executable.cases.project.IDFProjectJTAGFlashTest ► :
tests/com.espressif.idf.ui.test/target/surefire-reports/TEST-com.espressif.idf.ui.test.executable.cases.project.IDFProjectJTAGFlashTest.xml#L0
Failed test found in:
tests/com.espressif.idf.ui.test/target/surefire-reports/TEST-com.espressif.idf.ui.test.executable.cases.project.IDFProjectJTAGFlashTest.xml
Error:
org.eclipse.swtbot.swt.finder.exceptions.WidgetNotFoundException: Could not find editor matching: with name '"ESP-IDF Manager"'
|
|
com.espressif.idf.ui.test.executable.cases.project.IDFProjectLaunchTargetEditorFunctionalityTest ► :
tests/com.espressif.idf.ui.test/target/surefire-reports/TEST-com.espressif.idf.ui.test.executable.cases.project.IDFProjectLaunchTargetEditorFunctionalityTest.xml#L0
Failed test found in:
tests/com.espressif.idf.ui.test/target/surefire-reports/TEST-com.espressif.idf.ui.test.executable.cases.project.IDFProjectLaunchTargetEditorFunctionalityTest.xml
Error:
org.eclipse.swtbot.swt.finder.exceptions.WidgetNotFoundException: Could not find editor matching: with name '"ESP-IDF Manager"'
|
|
com.espressif.idf.ui.test.executable.cases.project.IDFProjectLspCdtFunctionalityTest ► :
tests/com.espressif.idf.ui.test/target/surefire-reports/TEST-com.espressif.idf.ui.test.executable.cases.project.IDFProjectLspCdtFunctionalityTest.xml#L0
Failed test found in:
tests/com.espressif.idf.ui.test/target/surefire-reports/TEST-com.espressif.idf.ui.test.executable.cases.project.IDFProjectLspCdtFunctionalityTest.xml
Error:
org.opentest4j.MultipleFailuresError:
|
|
com.espressif.idf.ui.test.executable.cases.project.IDFProjectToolsInstallationTest ► :
tests/com.espressif.idf.ui.test/target/surefire-reports/TEST-com.espressif.idf.ui.test.executable.cases.project.IDFProjectToolsInstallationTest.xml#L0
Failed test found in:
tests/com.espressif.idf.ui.test/target/surefire-reports/TEST-com.espressif.idf.ui.test.executable.cases.project.IDFProjectToolsInstallationTest.xml
Error:
org.eclipse.swtbot.swt.finder.exceptions.WidgetNotFoundException: Could not find widget matching: (of type 'Table')
|
|
com.espressif.idf.ui.test.executable.cases.project.NewEspressifIDFProjectClangFilesTest ► :
tests/com.espressif.idf.ui.test/target/surefire-reports/TEST-com.espressif.idf.ui.test.executable.cases.project.NewEspressifIDFProjectClangFilesTest.xml#L0
Failed test found in:
tests/com.espressif.idf.ui.test/target/surefire-reports/TEST-com.espressif.idf.ui.test.executable.cases.project.NewEspressifIDFProjectClangFilesTest.xml
Error:
org.eclipse.swtbot.swt.finder.exceptions.WidgetNotFoundException: Could not find editor matching: with name '"ESP-IDF Manager"'
|
|
com.espressif.idf.ui.test.executable.cases.project.NewEspressifIDFProjectFlashProcessTest ► :
tests/com.espressif.idf.ui.test/target/surefire-reports/TEST-com.espressif.idf.ui.test.executable.cases.project.NewEspressifIDFProjectFlashProcessTest.xml#L0
Failed test found in:
tests/com.espressif.idf.ui.test/target/surefire-reports/TEST-com.espressif.idf.ui.test.executable.cases.project.NewEspressifIDFProjectFlashProcessTest.xml
Error:
org.eclipse.swtbot.swt.finder.exceptions.WidgetNotFoundException: Could not find editor matching: with name '"ESP-IDF Manager"'
|
|
com.espressif.idf.ui.test.executable.cases.project.NewEspressifIDFProjectPartitionTableEditorTest ► :
tests/com.espressif.idf.ui.test/target/surefire-reports/TEST-com.espressif.idf.ui.test.executable.cases.project.NewEspressifIDFProjectPartitionTableEditorTest.xml#L0
Failed test found in:
tests/com.espressif.idf.ui.test/target/surefire-reports/TEST-com.espressif.idf.ui.test.executable.cases.project.NewEspressifIDFProjectPartitionTableEditorTest.xml
Error:
org.eclipse.swtbot.swt.finder.exceptions.WidgetNotFoundException: Could not find editor matching: with name '"ESP-IDF Manager"'
|
|
com.espressif.idf.ui.test.executable.cases.project.NewEspressifIDFProjectSBOMTest ► :
tests/com.espressif.idf.ui.test/target/surefire-reports/TEST-com.espressif.idf.ui.test.executable.cases.project.NewEspressifIDFProjectSBOMTest.xml#L0
Failed test found in:
tests/com.espressif.idf.ui.test/target/surefire-reports/TEST-com.espressif.idf.ui.test.executable.cases.project.NewEspressifIDFProjectSBOMTest.xml
Error:
org.eclipse.swtbot.swt.finder.exceptions.WidgetNotFoundException: Could not find editor matching: with name '"ESP-IDF Manager"'
|
|
com.espressif.idf.ui.test.executable.cases.project.NewEspressifIDFProjectSDKconfigTest ► :
tests/com.espressif.idf.ui.test/target/surefire-reports/TEST-com.espressif.idf.ui.test.executable.cases.project.NewEspressifIDFProjectSDKconfigTest.xml#L0
Failed test found in:
tests/com.espressif.idf.ui.test/target/surefire-reports/TEST-com.espressif.idf.ui.test.executable.cases.project.NewEspressifIDFProjectSDKconfigTest.xml
Error:
org.eclipse.swtbot.swt.finder.exceptions.WidgetNotFoundException: Could not find widget matching: (of type 'Table')
|
|
com.espressif.idf.ui.test.executable.cases.project.NewEspressifIDFProjectTest ► :
tests/com.espressif.idf.ui.test/target/surefire-reports/TEST-com.espressif.idf.ui.test.executable.cases.project.NewEspressifIDFProjectTest.xml#L0
Failed test found in:
tests/com.espressif.idf.ui.test/target/surefire-reports/TEST-com.espressif.idf.ui.test.executable.cases.project.NewEspressifIDFProjectTest.xml
Error:
org.eclipse.swtbot.swt.finder.exceptions.WidgetNotFoundException: Could not find editor matching: with name '"ESP-IDF Manager"'
|
|
build_linux
Failed tests were found and 'fail-on-error' option is set to true
|
|
build_linux
Process completed with exit code 1.
|
Artifacts
Produced during runtime
| Name | Size | Digest | |
|---|---|---|---|
|
Espressif-IDE-4.0.0-linux.gtk.aarch64
|
318 MB |
sha256:a1b724b5b8958facbdbe9c9262c77a15d888f5771a375c2a7eb8062757b930ad
|
|
|
Espressif-IDE-4.0.0-linux.gtk.x86_64
|
319 MB |
sha256:9c2af536165177a9e98454b829de616a568d9469d69e9565c8732f49557b25ce
|
|
|
Espressif-IDE-4.0.0-macosx.cocoa.aarch64
|
316 MB |
sha256:945b937299348473185853baab21a47599b36a048355d7ea89ccf902fc989fa0
|
|
|
Espressif-IDE-4.0.0-macosx.cocoa.x86_64
|
317 MB |
sha256:6c4aa7b1ca866f5a2c94d6bb2e5d45fef458892b26b515e30ba6dc3c26ab908c
|
|
|
Espressif-IDE-4.0.0-win32
|
317 MB |
sha256:cc069bc4cee1f205edce2ff2c2a3266bb7ab188f0bced8356118b989e467151f
|
|
|
com.espressif.idf.update-4.0.0
|
554 MB |
sha256:e421078aeb8727db7f4a2d66bb1badfe457ccfe7769e87c2ca37c796a9f541dc
|
|