WIP: SWTBot test case: Environment Variables verification #2218
Annotations
11 errors
|
com.espressif.idf.ui.test.executable.cases.launchconfiguration.LaunchBarCDTConfigurationsTest ► :
tests/com.espressif.idf.ui.test/target/surefire-reports/TEST-com.espressif.idf.ui.test.executable.cases.launchconfiguration.LaunchBarCDTConfigurationsTest.xml#L0
Failed test found in:
tests/com.espressif.idf.ui.test/target/surefire-reports/TEST-com.espressif.idf.ui.test.executable.cases.launchconfiguration.LaunchBarCDTConfigurationsTest.xml
Error:
org.opentest4j.MultipleFailuresError:
|
|
com.espressif.idf.ui.test.executable.cases.project.IDFProjectJTAGFlashTest ► :
tests/com.espressif.idf.ui.test/target/surefire-reports/TEST-com.espressif.idf.ui.test.executable.cases.project.IDFProjectJTAGFlashTest.xml#L0
Failed test found in:
tests/com.espressif.idf.ui.test/target/surefire-reports/TEST-com.espressif.idf.ui.test.executable.cases.project.IDFProjectJTAGFlashTest.xml
Error:
org.eclipse.swtbot.swt.finder.exceptions.WidgetNotFoundException: Could not find editor matching: with name '"ESP-IDF Manager"'
|
|
com.espressif.idf.ui.test.executable.cases.project.IDFProjectLaunchTargetEditorFunctionalityTest ► :
tests/com.espressif.idf.ui.test/target/surefire-reports/TEST-com.espressif.idf.ui.test.executable.cases.project.IDFProjectLaunchTargetEditorFunctionalityTest.xml#L0
Failed test found in:
tests/com.espressif.idf.ui.test/target/surefire-reports/TEST-com.espressif.idf.ui.test.executable.cases.project.IDFProjectLaunchTargetEditorFunctionalityTest.xml
Error:
org.eclipse.swtbot.swt.finder.exceptions.WidgetNotFoundException: Could not find editor matching: with name '"ESP-IDF Manager"'
|
|
com.espressif.idf.ui.test.executable.cases.project.IDFProjectLspCdtFunctionalityTest ► :
tests/com.espressif.idf.ui.test/target/surefire-reports/TEST-com.espressif.idf.ui.test.executable.cases.project.IDFProjectLspCdtFunctionalityTest.xml#L0
Failed test found in:
tests/com.espressif.idf.ui.test/target/surefire-reports/TEST-com.espressif.idf.ui.test.executable.cases.project.IDFProjectLspCdtFunctionalityTest.xml
Error:
org.opentest4j.MultipleFailuresError:
|
|
com.espressif.idf.ui.test.executable.cases.project.IDFProjectToolsInstallationTest ► :
tests/com.espressif.idf.ui.test/target/surefire-reports/TEST-com.espressif.idf.ui.test.executable.cases.project.IDFProjectToolsInstallationTest.xml#L0
Failed test found in:
tests/com.espressif.idf.ui.test/target/surefire-reports/TEST-com.espressif.idf.ui.test.executable.cases.project.IDFProjectToolsInstallationTest.xml
Error:
org.eclipse.swtbot.swt.finder.exceptions.WidgetNotFoundException: Could not find editor matching: with name '"ESP-IDF Manager"'
|
|
com.espressif.idf.ui.test.executable.cases.project.NewEspressifIDFProjectClangFilesTest ► :
tests/com.espressif.idf.ui.test/target/surefire-reports/TEST-com.espressif.idf.ui.test.executable.cases.project.NewEspressifIDFProjectClangFilesTest.xml#L0
Failed test found in:
tests/com.espressif.idf.ui.test/target/surefire-reports/TEST-com.espressif.idf.ui.test.executable.cases.project.NewEspressifIDFProjectClangFilesTest.xml
Error:
org.eclipse.swtbot.swt.finder.exceptions.WidgetNotFoundException: Could not find editor matching: with name '"ESP-IDF Manager"'
|
|
com.espressif.idf.ui.test.executable.cases.project.NewEspressifIDFProjectFlashProcessTest ► :
tests/com.espressif.idf.ui.test/target/surefire-reports/TEST-com.espressif.idf.ui.test.executable.cases.project.NewEspressifIDFProjectFlashProcessTest.xml#L0
Failed test found in:
tests/com.espressif.idf.ui.test/target/surefire-reports/TEST-com.espressif.idf.ui.test.executable.cases.project.NewEspressifIDFProjectFlashProcessTest.xml
Error:
org.eclipse.swtbot.swt.finder.exceptions.WidgetNotFoundException: Could not find editor matching: with name '"ESP-IDF Manager"'
|
|
com.espressif.idf.ui.test.executable.cases.project.NewEspressifIDFProjectPartitionTableEditorTest ► :
tests/com.espressif.idf.ui.test/target/surefire-reports/TEST-com.espressif.idf.ui.test.executable.cases.project.NewEspressifIDFProjectPartitionTableEditorTest.xml#L0
Failed test found in:
tests/com.espressif.idf.ui.test/target/surefire-reports/TEST-com.espressif.idf.ui.test.executable.cases.project.NewEspressifIDFProjectPartitionTableEditorTest.xml
Error:
org.eclipse.swtbot.swt.finder.exceptions.WidgetNotFoundException: Could not find editor matching: with name '"ESP-IDF Manager"'
|
|
com.espressif.idf.ui.test.executable.cases.project.NewEspressifIDFProjectSBOMTest ► :
tests/com.espressif.idf.ui.test/target/surefire-reports/TEST-com.espressif.idf.ui.test.executable.cases.project.NewEspressifIDFProjectSBOMTest.xml#L0
Failed test found in:
tests/com.espressif.idf.ui.test/target/surefire-reports/TEST-com.espressif.idf.ui.test.executable.cases.project.NewEspressifIDFProjectSBOMTest.xml
Error:
org.eclipse.swtbot.swt.finder.exceptions.WidgetNotFoundException: Could not find editor matching: with name '"ESP-IDF Manager"'
|
|
com.espressif.idf.ui.test.executable.cases.project.NewEspressifIDFProjectSDKconfigTest ► :
tests/com.espressif.idf.ui.test/target/surefire-reports/TEST-com.espressif.idf.ui.test.executable.cases.project.NewEspressifIDFProjectSDKconfigTest.xml#L0
Failed test found in:
tests/com.espressif.idf.ui.test/target/surefire-reports/TEST-com.espressif.idf.ui.test.executable.cases.project.NewEspressifIDFProjectSDKconfigTest.xml
Error:
org.eclipse.swtbot.swt.finder.exceptions.WidgetNotFoundException: Could not find widget matching: (of type 'Table')
|
|
com.espressif.idf.ui.test.executable.cases.project.NewEspressifIDFProjectTest ► :
tests/com.espressif.idf.ui.test/target/surefire-reports/TEST-com.espressif.idf.ui.test.executable.cases.project.NewEspressifIDFProjectTest.xml#L0
Failed test found in:
tests/com.espressif.idf.ui.test/target/surefire-reports/TEST-com.espressif.idf.ui.test.executable.cases.project.NewEspressifIDFProjectTest.xml
Error:
org.eclipse.swtbot.swt.finder.exceptions.WidgetNotFoundException: Could not find editor matching: with name '"ESP-IDF Manager"'
|