Repository navigation
Expand file tree
/
Copy pathbuild_log_utf8.txt
More file actions
133 lines (128 loc) · 2.25 KB
/
Copy pathbuild_log_utf8.txt
File metadata and controls
133 lines (128 loc) · 2.25 KB
1
2
3
4
5
6
7
8
9
10
11
12
13
14
15
16
17
18
19
20
21
22
23
24
25
26
27
28
29
30
31
32
33
34
35
36
37
38
39
40
41
42
43
44
45
46
47
48
49
50
51
52
53
54
55
56
57
58
59
60
61
62
63
64
65
66
67
68
69
70
71
72
73
74
75
76
77
78
79
80
81
82
83
84
85
86
87
88
89
90
91
92
93
94
95
96
97
98
99
100
101
102
103
104
105
106
107
108
109
110
111
112
113
114
115
116
117
118
119
120
121
122
123
124
125
126
127
128
129
130
131
132
133
> Task :compileJava FAILED
.\gradlew : E:\plugi
ns\Paper-ShopCore\sr
c\main\java\me\minse
ok\shopsystem\utils\
MessageManager.java:
85: error: no suitab
le method found for
sendMessage(Componen
t)
위치 줄:1 문자:1
+ .\gradlew compileJ
ava > build_log.txt
2>&1 ; cat build_log
.txt
+ ~~~~~~~~~~~~~~~~~~
~~~~~~~~~~~~~~~~~~~~
~~~~
+ CategoryInfo
: NotS
pecified: (E:\p
lugins\Pape...s
age(Component): S
tring) [], Rem ot
eException
+ FullyQualifie
dErrorId : Nati
veCommandError
sender.sendM
essage(parse(prefix
+ getRaw(path)));
^
method CommandSe
nder.sendMessage(Str
ing) is not applicab
le
(argument mism
atch; Component cann
ot be converted to S
tring)
method CommandSe
nder.sendMessage(Str
ing...) is not appli
cable
(varargs misma
tch; Component canno
t be converted to St
ring)
method CommandSe
nder.sendMessage(UUI
D,String...) is not
applicable
(argument mism
atch; Component cann
ot be converted to U
UID)
E:\plugins\Paper-Sho
pCore\src\main\java\
me\minseok\shopsyste
m\utils\MessageManag
er.java:92: error: n
o suitable method fo
und for sendMessage(
Component)
sender.sendM
essage(parse(prefix
+ customMessage));
^
method CommandSe
nder.sendMessage(Str
ing) is not applicab
le
(argument mism
atch; Component cann
ot be converted to S
tring)
method CommandSe
nder.sendMessage(Str
ing...) is not appli
cable
(varargs misma
tch; Component canno
t be converted to St
ring)
method CommandSe
nder.sendMessage(UUI
D,String...) is not
applicable
(argument mism
atch; Component cann
ot be converted to U
UID)
Note: E:\plugins\Pap
er-ShopCore\src\main
\java\me\minseok\sho
psystem\economy\Vaul
tEconomy.java uses o
r overrides a deprec
ated API.
Note: Recompile with
-Xlint:deprecation
for details.
Note: Some messages
have been simplified
; recompile with -Xd
iags:verbose to get
full output
2 errors
FAILURE: Build faile
d with an exception.
* What went wrong:
Execution failed for
task ':compileJava'
.
> Compilation failed
; see the compiler e
rror output for deta
ils.
* Try:
> Run with --info op
tion to get more log
output.
> Run with --scan to
get full insights.
BUILD FAILED in 831m
s
1 actionable task: 1 executed