Repository navigation
feat!: support solidjs v2, drop support for v1 #25
Triggered via pull request
September 23, 2026 09:03
Status
Failure
Total duration
1m 44s
Artifacts
–
conventional-ci.yml
on: pull_request
conventional-ci
/
lint
29s
conventional-ci
/
typecheck
35s
Matrix: conventional-ci / test
Annotations
9 errors and 5 notices
|
conventional-ci / test (windows-latest, 22)
Process completed with exit code 1.
|
|
test/vite.test.ts > Vite > enforces the client-only boundary during builds:
test/vite.test.ts#L64
AssertionError: expected [Function] to throw error including '[unplugin-solid] Cannot import \'clie…' but got '\u001b[31mBuild failed with 1 error:\…'
- Expected
+ Received
- [unplugin-solid] Cannot import 'client-only' in a server module: D:\a\unplugin-solid\unplugin-solid\test\fixtures\boundaries\client-only.ts
+ Build failed with 1 error:
+
+ [plugin unplugin-solid]
+ RolldownError: [unplugin-solid] Cannot import 'client-only' in a server module: D:/a/unplugin-solid/unplugin-solid/test/fixtures/boundaries/client-only.ts
+ at error (file:///D:/a/unplugin-solid/unplugin-solid/node_modules/.pnpm/rolldown@1.1.5/node_modules/rolldown/dist/shared/logs-ZGEh6uhb.mjs:152:24)
+ at PluginContextImpl.error (file:///D:/a/unplugin-solid/unplugin-solid/node_modules/.pnpm/rolldown@1.1.5/node_modules/rolldown/dist/shared/bindingify-input-options-XPJLJOD0.mjs:89:10)
+ at PluginContextImpl.resolveId (D:/a/unplugin-solid/unplugin-solid/src/core/index.ts:556:16)
+ at PluginContextImpl.handler (file:///D:/a/unplugin-solid/unplugin-solid/node_modules/.pnpm/vite@8.1.4_@types+node@26.1_408443e97618f137c160c6f51f1db7b1/node_modules/vite/dist/node/chunks/node.js:33236:13)
+ at plugin (file:///D:/a/unplugin-solid/unplugin-solid/node_modules/.pnpm/rolldown@1.1.5/node_modules/rolldown/dist/shared/bindingify-input-options-XPJLJOD0.mjs:1418:30)
+ at plugin.<computed> (file:///D:/a/unplugin-solid/unplugin-solid/node_modules/.pnpm/rolldown@1.1.5/node_modules/rolldown/dist/shared/bindingify-input-options-XPJLJOD0.mjs:1959:18)
❯ test/vite.test.ts:64:55
|
|
test/vite.test.ts > Vite > enforces the server-only boundary during builds:
test/vite.test.ts#L64
AssertionError: expected [Function] to throw error including '[unplugin-solid] Cannot import \'serv…' but got '\u001b[31mBuild failed with 1 error:\…'
- Expected
+ Received
- [unplugin-solid] Cannot import 'server-only' in a client module: D:\a\unplugin-solid\unplugin-solid\test\fixtures\boundaries\server-only.ts
+ Build failed with 1 error:
+
+ [plugin unplugin-solid]
+ RolldownError: [unplugin-solid] Cannot import 'server-only' in a client module: D:/a/unplugin-solid/unplugin-solid/test/fixtures/boundaries/server-only.ts
+ at error (file:///D:/a/unplugin-solid/unplugin-solid/node_modules/.pnpm/rolldown@1.1.5/node_modules/rolldown/dist/shared/logs-ZGEh6uhb.mjs:152:24)
+ at PluginContextImpl.error (file:///D:/a/unplugin-solid/unplugin-solid/node_modules/.pnpm/rolldown@1.1.5/node_modules/rolldown/dist/shared/bindingify-input-options-XPJLJOD0.mjs:89:10)
+ at PluginContextImpl.resolveId (D:/a/unplugin-solid/unplugin-solid/src/core/index.ts:556:16)
+ at PluginContextImpl.handler (file:///D:/a/unplugin-solid/unplugin-solid/node_modules/.pnpm/vite@8.1.4_@types+node@26.1_408443e97618f137c160c6f51f1db7b1/node_modules/vite/dist/node/chunks/node.js:33236:13)
+ at plugin (file:///D:/a/unplugin-solid/unplugin-solid/node_modules/.pnpm/rolldown@1.1.5/node_modules/rolldown/dist/shared/bindingify-input-options-XPJLJOD0.mjs:1418:30)
+ at plugin.<computed> (file:///D:/a/unplugin-solid/unplugin-solid/node_modules/.pnpm/rolldown@1.1.5/node_modules/rolldown/dist/shared/bindingify-input-options-XPJLJOD0.mjs:1959:18)
❯ test/vite.test.ts:64:55
|
|
conventional-ci / test (windows-latest, 24)
Process completed with exit code 1.
|
|
test/vite.test.ts > Vite > enforces the client-only boundary during builds:
test/vite.test.ts#L64
AssertionError: expected [Function] to throw error including '[unplugin-solid] Cannot import \'clie…' but got '\u001b[31mBuild failed with 1 error:\…'
- Expected
+ Received
- [unplugin-solid] Cannot import 'client-only' in a server module: D:\a\unplugin-solid\unplugin-solid\test\fixtures\boundaries\client-only.ts
+ Build failed with 1 error:
+
+ [plugin unplugin-solid]
+ RolldownError: [unplugin-solid] Cannot import 'client-only' in a server module: D:/a/unplugin-solid/unplugin-solid/test/fixtures/boundaries/client-only.ts
+ at error (file:///D:/a/unplugin-solid/unplugin-solid/node_modules/.pnpm/rolldown@1.1.5/node_modules/rolldown/dist/shared/logs-ZGEh6uhb.mjs:152:24)
+ at PluginContextImpl.error (file:///D:/a/unplugin-solid/unplugin-solid/node_modules/.pnpm/rolldown@1.1.5/node_modules/rolldown/dist/shared/bindingify-input-options-XPJLJOD0.mjs:89:10)
+ at PluginContextImpl.resolveId (D:/a/unplugin-solid/unplugin-solid/src/core/index.ts:556:16)
+ at PluginContextImpl.handler (file:///D:/a/unplugin-solid/unplugin-solid/node_modules/.pnpm/vite@8.1.4_@types+node@26.1_408443e97618f137c160c6f51f1db7b1/node_modules/vite/dist/node/chunks/node.js:33236:13)
+ at plugin (file:///D:/a/unplugin-solid/unplugin-solid/node_modules/.pnpm/rolldown@1.1.5/node_modules/rolldown/dist/shared/bindingify-input-options-XPJLJOD0.mjs:1418:30)
+ at plugin.<computed> (file:///D:/a/unplugin-solid/unplugin-solid/node_modules/.pnpm/rolldown@1.1.5/node_modules/rolldown/dist/shared/bindingify-input-options-XPJLJOD0.mjs:1959:18)
❯ test/vite.test.ts:64:55
|
|
test/vite.test.ts > Vite > enforces the server-only boundary during builds:
test/vite.test.ts#L64
AssertionError: expected [Function] to throw error including '[unplugin-solid] Cannot import \'serv…' but got '\u001b[31mBuild failed with 1 error:\…'
- Expected
+ Received
- [unplugin-solid] Cannot import 'server-only' in a client module: D:\a\unplugin-solid\unplugin-solid\test\fixtures\boundaries\server-only.ts
+ Build failed with 1 error:
+
+ [plugin unplugin-solid]
+ RolldownError: [unplugin-solid] Cannot import 'server-only' in a client module: D:/a/unplugin-solid/unplugin-solid/test/fixtures/boundaries/server-only.ts
+ at error (file:///D:/a/unplugin-solid/unplugin-solid/node_modules/.pnpm/rolldown@1.1.5/node_modules/rolldown/dist/shared/logs-ZGEh6uhb.mjs:152:24)
+ at PluginContextImpl.error (file:///D:/a/unplugin-solid/unplugin-solid/node_modules/.pnpm/rolldown@1.1.5/node_modules/rolldown/dist/shared/bindingify-input-options-XPJLJOD0.mjs:89:10)
+ at PluginContextImpl.resolveId (D:/a/unplugin-solid/unplugin-solid/src/core/index.ts:556:16)
+ at PluginContextImpl.handler (file:///D:/a/unplugin-solid/unplugin-solid/node_modules/.pnpm/vite@8.1.4_@types+node@26.1_408443e97618f137c160c6f51f1db7b1/node_modules/vite/dist/node/chunks/node.js:33236:13)
+ at plugin (file:///D:/a/unplugin-solid/unplugin-solid/node_modules/.pnpm/rolldown@1.1.5/node_modules/rolldown/dist/shared/bindingify-input-options-XPJLJOD0.mjs:1418:30)
+ at plugin.<computed> (file:///D:/a/unplugin-solid/unplugin-solid/node_modules/.pnpm/rolldown@1.1.5/node_modules/rolldown/dist/shared/bindingify-input-options-XPJLJOD0.mjs:1959:18)
❯ test/vite.test.ts:64:55
|
|
conventional-ci / test (windows-latest, 26)
Process completed with exit code 1.
|
|
test/vite.test.ts > Vite > enforces the client-only boundary during builds:
test/vite.test.ts#L64
AssertionError: expected [Function] to throw error including '[unplugin-solid] Cannot import \'clie…' but got '\u001b[31mBuild failed with 1 error:\…'
- Expected
+ Received
- [unplugin-solid] Cannot import 'client-only' in a server module: D:\a\unplugin-solid\unplugin-solid\test\fixtures\boundaries\client-only.ts
+ Build failed with 1 error:
+
+ [plugin unplugin-solid]
+ RolldownError: [unplugin-solid] Cannot import 'client-only' in a server module: D:/a/unplugin-solid/unplugin-solid/test/fixtures/boundaries/client-only.ts
+ at error (file:///D:/a/unplugin-solid/unplugin-solid/node_modules/.pnpm/rolldown@1.1.5/node_modules/rolldown/dist/shared/logs-ZGEh6uhb.mjs:152:24)
+ at PluginContextImpl.error (file:///D:/a/unplugin-solid/unplugin-solid/node_modules/.pnpm/rolldown@1.1.5/node_modules/rolldown/dist/shared/bindingify-input-options-XPJLJOD0.mjs:89:10)
+ at PluginContextImpl.resolveId (D:/a/unplugin-solid/unplugin-solid/src/core/index.ts:556:16)
+ at PluginContextImpl.handler (file:///D:/a/unplugin-solid/unplugin-solid/node_modules/.pnpm/vite@8.1.4_@types+node@26.1_408443e97618f137c160c6f51f1db7b1/node_modules/vite/dist/node/chunks/node.js:33236:13)
+ at plugin (file:///D:/a/unplugin-solid/unplugin-solid/node_modules/.pnpm/rolldown@1.1.5/node_modules/rolldown/dist/shared/bindingify-input-options-XPJLJOD0.mjs:1418:30)
+ at plugin.<computed> (file:///D:/a/unplugin-solid/unplugin-solid/node_modules/.pnpm/rolldown@1.1.5/node_modules/rolldown/dist/shared/bindingify-input-options-XPJLJOD0.mjs:1959:18)
❯ test/vite.test.ts:64:55
|
|
test/vite.test.ts > Vite > enforces the server-only boundary during builds:
test/vite.test.ts#L64
AssertionError: expected [Function] to throw error including '[unplugin-solid] Cannot import \'serv…' but got '\u001b[31mBuild failed with 1 error:\…'
- Expected
+ Received
- [unplugin-solid] Cannot import 'server-only' in a client module: D:\a\unplugin-solid\unplugin-solid\test\fixtures\boundaries\server-only.ts
+ Build failed with 1 error:
+
+ [plugin unplugin-solid]
+ RolldownError: [unplugin-solid] Cannot import 'server-only' in a client module: D:/a/unplugin-solid/unplugin-solid/test/fixtures/boundaries/server-only.ts
+ at error (file:///D:/a/unplugin-solid/unplugin-solid/node_modules/.pnpm/rolldown@1.1.5/node_modules/rolldown/dist/shared/logs-ZGEh6uhb.mjs:152:24)
+ at PluginContextImpl.error (file:///D:/a/unplugin-solid/unplugin-solid/node_modules/.pnpm/rolldown@1.1.5/node_modules/rolldown/dist/shared/bindingify-input-options-XPJLJOD0.mjs:89:10)
+ at PluginContextImpl.resolveId (D:/a/unplugin-solid/unplugin-solid/src/core/index.ts:556:16)
+ at PluginContextImpl.handler (file:///D:/a/unplugin-solid/unplugin-solid/node_modules/.pnpm/vite@8.1.4_@types+node@26.1_408443e97618f137c160c6f51f1db7b1/node_modules/vite/dist/node/chunks/node.js:33236:13)
+ at plugin (file:///D:/a/unplugin-solid/unplugin-solid/node_modules/.pnpm/rolldown@1.1.5/node_modules/rolldown/dist/shared/bindingify-input-options-XPJLJOD0.mjs:1418:30)
+ at plugin.<computed> (file:///D:/a/unplugin-solid/unplugin-solid/node_modules/.pnpm/rolldown@1.1.5/node_modules/rolldown/dist/shared/bindingify-input-options-XPJLJOD0.mjs:1959:18)
❯ test/vite.test.ts:64:55
|
|
conventional-ci / test (ubuntu-latest, 22)
"The ubuntu-latest label will migrate to Ubuntu 26 beginning October 19, 2026. For more information, see https://github.com/actions/runner-images/issues/14748"
|
|
conventional-ci / test (ubuntu-latest, 24)
"The ubuntu-latest label will migrate to Ubuntu 26 beginning October 19, 2026. For more information, see https://github.com/actions/runner-images/issues/14748"
|
|
conventional-ci / lint
"The ubuntu-latest label will migrate to Ubuntu 26 beginning October 19, 2026. For more information, see https://github.com/actions/runner-images/issues/14748"
|
|
conventional-ci / test (ubuntu-latest, 26)
"The ubuntu-latest label will migrate to Ubuntu 26 beginning October 19, 2026. For more information, see https://github.com/actions/runner-images/issues/14748"
|
|
conventional-ci / typecheck
"The ubuntu-latest label will migrate to Ubuntu 26 beginning October 19, 2026. For more information, see https://github.com/actions/runner-images/issues/14748"
|