zig dependents: fix CPU target for arm64 Linux #542792
Annotations
10 errors, 2 warnings, and 4 notices
Test formulae
bold 0.1.0 did not build
|
Test formulae:
Formula/b/bold.rb#L19
Already downloaded: /Users/brew/Library/Caches/Homebrew/downloads/38d72eb6e7e0952470e21636617021cfe9212dc9f6a20960954512f3539ccd02--bold-0.1.0.tar.gz
==> Verifying checksum for '38d72eb6e7e0952470e21636617021cfe9212dc9f6a20960954512f3539ccd02--bold-0.1.0.tar.gz'
/usr/bin/env tar --extract --no-same-owner --file /Users/brew/Library/Caches/Homebrew/downloads/38d72eb6e7e0952470e21636617021cfe9212dc9f6a20960954512f3539ccd02--bold-0.1.0.tar.gz --directory /private/tmp/homebrew-unpack-20250321-8985-e78hs1
mv /private/tmp/homebrew-unpack-20250321-8985-e78hs1/bold-0.1.0 /private/tmp/bold-20250321-8985-vhmkn4/bold-0.1.0
==> zig build -Dstrip=true -Dcpu=apple_m1 --prefix /opt/homebrew/Cellar/bold/0.1.0 --release=fast -Doptimize=ReleaseFast --summary all -fno-rosetta
/private/tmp/bold-20250321-8985-vhmkn4/bold-0.1.0/build.zig.zon:2:13: error: expected enum literal
.name = "bold",
^~~~~~
==> Formula
Path: /opt/homebrew/Library/Taps/homebrew/homebrew-core/Formula/b/bold.rb
==> Configuration
HOMEBREW_VERSION: 4.4.25-31-g7ddc4b0
ORIGIN: https://github.com/Homebrew/brew
HEAD: 7ddc4b0196b651bc0975a8b48545bc6ced070476
Last commit: 3 hours ago
Branch: master
Core tap HEAD: 095d5485dea160920513eec3ba09da9b40b4dddf
Core tap last commit: 7 minutes ago
Core tap JSON: 21 Mar 13:21 UTC
Core cask tap JSON: 21 Mar 13:21 UTC
HOMEBREW_PREFIX: /opt/homebrew
HOMEBREW_BOOTSNAP: set
HOMEBREW_CACHE: /Users/brew/Library/Caches/Homebrew
HOMEBREW_CASK_OPTS: []
HOMEBREW_COLOR: set
HOMEBREW_CURL_PATH: /usr/bin/curl
HOMEBREW_FAIL_LOG_LINES: 150
HOMEBREW_GITHUB_API_TOKEN: set
HOMEBREW_GIT_EMAIL: [email protected]
HOMEBREW_GIT_NAME: BrewTestBot
HOMEBREW_GIT_PATH: /usr/bin/git
HOMEBREW_LOGS: /Users/brew/actions-runner/_work/homebrew-core/homebrew-core/bottles/logs
HOMEBREW_MAKE_JOBS: 4
HOMEBREW_NO_AUTO_UPDATE: set
HOMEBREW_NO_EMOJI: set
HOMEBREW_NO_ENV_HINTS: set
HOMEBREW_NO_INSTALLED_DEPENDENTS_CHECK: set
HOMEBREW_NO_INSTALL_FROM_API: set
HOMEBREW_SORBET_RUNTIME: set
HOMEBREW_VERIFY_ATTESTATIONS: set
Homebrew Ruby: 3.3.7 => /opt/homebrew/Library/Homebrew/vendor/portable-ruby/3.3.7/bin/ruby
CPU: quad-core 64-bit dunno
Clang: 16.0.0 build 1600
Git: 2.39.5 => /usr/bin/git
Curl: 8.7.1 => /usr/bin/curl
macOS: 14.7.2-arm64
CLT: 16.2.0.0.1.1733547573
Xcode: 16.2
Rosetta 2: false
==> ENV
HOMEBREW_CC: clang
HOMEBREW_CXX: clang++
MAKEFLAGS: -j4
CMAKE_PREFIX_PATH: /opt/homebrew
CMAKE_INCLUDE_PATH: /Library/Developer/CommandLineTools/SDKs/MacOSX14.sdk/System/Library/Frameworks/OpenGL.framework/Versions/Current/Headers
CMAKE_LIBRARY_PATH: /Library/Developer/CommandLineTools/SDKs/MacOSX14.sdk/System/Library/Frameworks/OpenGL.framework/Versions/Current/Libraries
PKG_CONFIG_LIBDIR: /usr/lib/pkgconfig:/opt/homebrew/Library/Homebrew/os/mac/pkgconfig/14
HOMEBREW_MAKE_JOBS: 4
HOMEBREW_GIT: /usr/bin/git
HOMEBREW_SDKROOT: /Library/Developer/CommandLineTools/SDKs/MacOSX14.sdk
PATH: /opt/homebrew/Library/Homebrew/shims/mac/super:/opt/homebrew/opt/zig/bin:/usr/bin:/bin:/usr/sbin:/sbin
Logs:
/Users/brew/actions-runner/_work/homebrew-core/homebrew-core/bottles/logs/bold/00.options.out
/Users/brew/actions-runner/_work/homebrew-core/homebrew-core/bottles/logs/bold/01.zig
READ THIS: https://docs.brew.sh/Troubleshooting
::error::bold 0.1.0 did not build
|
Test formulae
install failed
|
Test formulae
flow-control 0.3.3 did not build
|
Test formulae:
Formula/f/flow-control.rb#L22
mv /private/tmp/homebrew-unpack-20250321-29642-kpava5/help.md /private/tmp/flow-control-20250321-29642-zq37x0/help.md
mv /private/tmp/homebrew-unpack-20250321-29642-kpava5/src /private/tmp/flow-control-20250321-29642-zq37x0/src
mv /private/tmp/homebrew-unpack-20250321-29642-kpava5/test /private/tmp/flow-control-20250321-29642-zq37x0/test
mv /private/tmp/homebrew-unpack-20250321-29642-kpava5/zig /private/tmp/flow-control-20250321-29642-zq37x0/zig
==> zig build --prefix /opt/homebrew/Cellar/flow-control/0.3.3 -Doptimize=ReleaseFast -Dcpu=apple_m1
/private/tmp/flow-control-20250321-29642-zq37x0/build.zig.zon:2:13: error: expected enum literal
.name = "flow",
^~~~~~
==> Formula
Path: /opt/homebrew/Library/Taps/homebrew/homebrew-core/Formula/f/flow-control.rb
==> Configuration
HOMEBREW_VERSION: 4.4.25-31-g7ddc4b0
ORIGIN: https://github.com/Homebrew/brew
HEAD: 7ddc4b0196b651bc0975a8b48545bc6ced070476
Last commit: 3 hours ago
Branch: master
Core tap HEAD: 095d5485dea160920513eec3ba09da9b40b4dddf
Core tap last commit: 12 minutes ago
Core tap JSON: 21 Mar 13:21 UTC
Core cask tap JSON: 21 Mar 13:21 UTC
HOMEBREW_PREFIX: /opt/homebrew
HOMEBREW_BOOTSNAP: set
HOMEBREW_CACHE: /Users/brew/Library/Caches/Homebrew
HOMEBREW_CASK_OPTS: []
HOMEBREW_COLOR: set
HOMEBREW_CURL_PATH: /usr/bin/curl
HOMEBREW_FAIL_LOG_LINES: 150
HOMEBREW_GITHUB_API_TOKEN: set
HOMEBREW_GIT_EMAIL: [email protected]
HOMEBREW_GIT_NAME: BrewTestBot
HOMEBREW_GIT_PATH: /usr/bin/git
HOMEBREW_LOGS: /Users/brew/actions-runner/_work/homebrew-core/homebrew-core/bottles/logs
HOMEBREW_MAKE_JOBS: 4
HOMEBREW_NO_AUTO_UPDATE: set
HOMEBREW_NO_EMOJI: set
HOMEBREW_NO_ENV_HINTS: set
HOMEBREW_NO_INSTALLED_DEPENDENTS_CHECK: set
HOMEBREW_NO_INSTALL_FROM_API: set
HOMEBREW_SORBET_RUNTIME: set
HOMEBREW_VERIFY_ATTESTATIONS: set
Homebrew Ruby: 3.3.7 => /opt/homebrew/Library/Homebrew/vendor/portable-ruby/3.3.7/bin/ruby
CPU: quad-core 64-bit dunno
Clang: 16.0.0 build 1600
Git: 2.39.5 => /usr/bin/git
Curl: 8.7.1 => /usr/bin/curl
macOS: 14.7.2-arm64
CLT: 16.2.0.0.1.1733547573
Xcode: 16.2
Rosetta 2: false
==> ENV
HOMEBREW_CC: clang
HOMEBREW_CXX: clang++
MAKEFLAGS: -j4
CMAKE_PREFIX_PATH: /opt/homebrew/opt/readline:/opt/homebrew/opt/sqlite:/opt/homebrew/opt/expat:/opt/homebrew/opt/llvm:/opt/homebrew
CMAKE_INCLUDE_PATH: /Library/Developer/CommandLineTools/SDKs/MacOSX14.sdk/System/Library/Frameworks/OpenGL.framework/Versions/Current/Headers
CMAKE_LIBRARY_PATH: /Library/Developer/CommandLineTools/SDKs/MacOSX14.sdk/System/Library/Frameworks/OpenGL.framework/Versions/Current/Libraries
CMAKE_FRAMEWORK_PATH: /opt/homebrew/opt/[email protected]/Frameworks
PKG_CONFIG_PATH: /opt/homebrew/opt/mpdecimal/lib/pkgconfig:/opt/homebrew/opt/openssl@3/lib/pkgconfig:/opt/homebrew/opt/readline/lib/pkgconfig:/opt/homebrew/opt/sqlite/lib/pkgconfig:/opt/homebrew/opt/xz/lib/pkgconfig:/opt/homebrew/opt/expat/lib/pkgconfig:/opt/homebrew/opt/[email protected]/lib/pkgconfig:/opt/homebrew/opt/z3/lib/pkgconfig:/opt/homebrew/opt/lz4/lib/pkgconfig:/opt/homebrew/opt/zstd/lib/pkgconfig
PKG_CONFIG_LIBDIR: /usr/lib/pkgconfig:/opt/homebrew/Library/Homebrew/os/mac/pkgconfig/14
HOMEBREW_MAKE_JOBS: 4
HOMEBREW_GIT: /usr/bin/git
HOMEBREW_SDKROOT: /Library/Developer/CommandLineTools/SDKs/MacOSX14.sdk
PATH: /opt/homebrew/Library/Homebrew/shims/mac/super:/opt/homebrew/opt/openssl@3/bin:/opt/homebrew/opt/sqlite/bin:/opt/homebrew/opt/xz/bin:/opt/homebrew/opt/expat/bin:/opt/homebrew/opt/[email protected]/bin:/opt/homebrew/opt/z3/bin:/opt/homebrew/opt/lz4/bin:/opt/homebrew/opt/zstd/bin:/opt/homebrew/opt/llvm/bin:/opt/homebrew/opt/lld/bin:/opt/homebrew/opt/zig/bin:/opt/homebrew/opt/[email protected]/libexec/bin:/usr/bin:/bin:/usr/sbin:/sbin
Logs:
/Users/brew/actions-runner/_work/homebrew-core/homebrew-core/bottles/logs/flow-control/00.options.out
/Users/brew/actions-runner/_work/homebrew-core/homebrew-core/bottles/logs/flow-control/01.zig
READ THIS: https://docs.brew.sh/Troubleshooting
::error::flow-control 0.3.3 did not build
|
Test formulae
install failed
|
Test formulae
hevi 1.1.0 did not build
|
Test formulae:
Formula/h/hevi.rb#L19
Already downloaded: /Users/brew/Library/Caches/Homebrew/downloads/787dd74b4871dc4c9790ffe87ca21876da0977f52e7cdbfdb508e454e1e0bc78--hevi-1.1.0.tar.gz
==> Verifying checksum for '787dd74b4871dc4c9790ffe87ca21876da0977f52e7cdbfdb508e454e1e0bc78--hevi-1.1.0.tar.gz'
/usr/bin/env tar --extract --no-same-owner --file /Users/brew/Library/Caches/Homebrew/downloads/787dd74b4871dc4c9790ffe87ca21876da0977f52e7cdbfdb508e454e1e0bc78--hevi-1.1.0.tar.gz --directory /private/tmp/homebrew-unpack-20250321-52692-n2u301
mv /private/tmp/homebrew-unpack-20250321-52692-n2u301/hevi-1.1.0 /private/tmp/hevi-20250321-52692-1lzwgk/hevi-1.1.0
==> zig build -Dcpu=apple_m1 --prefix /opt/homebrew/Cellar/hevi/1.1.0 --release=fast -Doptimize=ReleaseFast --summary all -fno-rosetta
/private/tmp/hevi-20250321-52692-1lzwgk/hevi-1.1.0/build.zig.zon:2:13: error: expected enum literal
.name = "hevi",
^~~~~~
==> Formula
Path: /opt/homebrew/Library/Taps/homebrew/homebrew-core/Formula/h/hevi.rb
==> Configuration
HOMEBREW_VERSION: 4.4.25-31-g7ddc4b0
ORIGIN: https://github.com/Homebrew/brew
HEAD: 7ddc4b0196b651bc0975a8b48545bc6ced070476
Last commit: 3 hours ago
Branch: master
Core tap HEAD: 095d5485dea160920513eec3ba09da9b40b4dddf
Core tap last commit: 17 minutes ago
Core tap JSON: 21 Mar 13:21 UTC
Core cask tap JSON: 21 Mar 13:21 UTC
HOMEBREW_PREFIX: /opt/homebrew
HOMEBREW_BOOTSNAP: set
HOMEBREW_CACHE: /Users/brew/Library/Caches/Homebrew
HOMEBREW_CASK_OPTS: []
HOMEBREW_COLOR: set
HOMEBREW_CURL_PATH: /usr/bin/curl
HOMEBREW_FAIL_LOG_LINES: 150
HOMEBREW_GITHUB_API_TOKEN: set
HOMEBREW_GIT_EMAIL: [email protected]
HOMEBREW_GIT_NAME: BrewTestBot
HOMEBREW_GIT_PATH: /usr/bin/git
HOMEBREW_LOGS: /Users/brew/actions-runner/_work/homebrew-core/homebrew-core/bottles/logs
HOMEBREW_MAKE_JOBS: 4
HOMEBREW_NO_AUTO_UPDATE: set
HOMEBREW_NO_EMOJI: set
HOMEBREW_NO_ENV_HINTS: set
HOMEBREW_NO_INSTALLED_DEPENDENTS_CHECK: set
HOMEBREW_NO_INSTALL_FROM_API: set
HOMEBREW_SORBET_RUNTIME: set
HOMEBREW_VERIFY_ATTESTATIONS: set
Homebrew Ruby: 3.3.7 => /opt/homebrew/Library/Homebrew/vendor/portable-ruby/3.3.7/bin/ruby
CPU: quad-core 64-bit dunno
Clang: 16.0.0 build 1600
Git: 2.39.5 => /usr/bin/git
Curl: 8.7.1 => /usr/bin/curl
macOS: 14.7.2-arm64
CLT: 16.2.0.0.1.1733547573
Xcode: 16.2
Rosetta 2: false
==> ENV
HOMEBREW_CC: clang
HOMEBREW_CXX: clang++
MAKEFLAGS: -j4
CMAKE_PREFIX_PATH: /opt/homebrew
CMAKE_INCLUDE_PATH: /Library/Developer/CommandLineTools/SDKs/MacOSX14.sdk/System/Library/Frameworks/OpenGL.framework/Versions/Current/Headers
CMAKE_LIBRARY_PATH: /Library/Developer/CommandLineTools/SDKs/MacOSX14.sdk/System/Library/Frameworks/OpenGL.framework/Versions/Current/Libraries
PKG_CONFIG_LIBDIR: /usr/lib/pkgconfig:/opt/homebrew/Library/Homebrew/os/mac/pkgconfig/14
HOMEBREW_MAKE_JOBS: 4
HOMEBREW_GIT: /usr/bin/git
HOMEBREW_SDKROOT: /Library/Developer/CommandLineTools/SDKs/MacOSX14.sdk
PATH: /opt/homebrew/Library/Homebrew/shims/mac/super:/opt/homebrew/opt/zig/bin:/usr/bin:/bin:/usr/sbin:/sbin
Logs:
/Users/brew/actions-runner/_work/homebrew-core/homebrew-core/bottles/logs/hevi/00.options.out
/Users/brew/actions-runner/_work/homebrew-core/homebrew-core/bottles/logs/hevi/01.zig
READ THIS: https://docs.brew.sh/Troubleshooting
::error::hevi 1.1.0 did not build
|
Test formulae
install failed
|
Test formulae
superhtml 0.5.3 did not build
|
Post-build steps
String '/opt/homebrew' still exists in these files:
|
Post-build steps
String '/opt/homebrew/Cellar' still exists in these files:
|
Post-build steps
4 bottle(s)
|
Post-build steps
0 failed bottle(s)
|
Post-build steps
1 list(s) of skipped formulae
|
Post-build steps
0 list(s) of successfully tested dependents
|
Loading